Makehuman script help

MakeHuman python API, python plugins, etc

Moderator: joepal

Makehuman script help

Postby krollquink » Thu Oct 08, 2015 7:42 am

sorry for my bad english,

i doing some research about 3d human model and i want to make a script to create human model automatically with different cloth ,hair etc and then export it for blender.
im new to python and now still learning it. So for the make human where should i start ? should i start with the documentation? because i read other post before and they suggest to read the documentation.
krollquink
 
Posts: 12
Joined: Mon Jun 08, 2015 3:02 am
Location: Japan

Re: Makehuman script help

Postby duststorm » Thu Oct 08, 2015 8:41 am

First, perhaps check the commandline fork. It might already do what you want.
MakeHuman™ developer
User avatar
duststorm
 
Posts: 2563
Joined: Fri Jan 27, 2012 11:57 am
Location: Belgium

Re: Makehuman script help

Postby krollquink » Fri Oct 09, 2015 5:59 am

thankyou for the fast reply!!

i try to download from this site
https://bitbucket.org/duststorm01/makehuman-commandline/downloads

is it correct?
krollquink
 
Posts: 12
Joined: Mon Jun 08, 2015 3:02 am
Location: Japan

Re: Makehuman script help

Postby krollquink » Fri Oct 09, 2015 7:19 am

i tried to run it in cmd and it does nothing?

is there any problem?
Attachments
makehuman1.png
krollquink
 
Posts: 12
Joined: Mon Jun 08, 2015 3:02 am
Location: Japan

Re: Makehuman script help

Postby joepal » Fri Oct 09, 2015 8:58 am

What's with the backslashes? What's the system character set?

Are any files created in [my documents]\makehuman? Specifically anything sounding like:

- makehuman.log
- makehuman-debug.txt
- python.err
- python.out
Joel Palmius (LinkedIn)
MakeHuman Infrastructure Manager
http://www.palmius.com/joel
joepal
 
Posts: 3453
Joined: Wed Jun 04, 2008 11:20 am

Re: Makehuman script help

Postby duststorm » Fri Oct 09, 2015 8:37 pm

That's odd, it might be a crash.
Make sure you are using 32bit python with the right versions of dependencies.
Check if there's anything in the log files.


krollquink wrote:i try to download from this site
https://bitbucket.org/duststorm01/makehuman-commandline/downloads

is it correct?

Yes, that's the one. It's the commandline fork on my bitbucket account.
It's planned to be merged in the official release once it's finished and stable.
MakeHuman™ developer
User avatar
duststorm
 
Posts: 2563
Joined: Fri Jan 27, 2012 11:57 am
Location: Belgium

Re: Makehuman script help

Postby krollquink » Sat Oct 10, 2015 12:48 am

this is the file that created
- makehuman.log
Code: Select all
[2015-10-09 16:14:39,653] log.py->message():115 -- MESSAGE -- Initialized logging
[2015-10-09 16:14:39,657] log.py->debug():94 -- DEBUG -- VERSION: 1.1.0 (r? UNKNOWN) [none found]
[2015-10-09 16:14:39,657] log.py->debug():94 -- DEBUG -- HG REVISION: r? (UNKNOWN) [none found]
[2015-10-09 16:14:39,657] log.py->debug():94 -- DEBUG -- SHORT VERSION: v1.1.0
[2015-10-09 16:14:39,657] log.py->debug():94 -- DEBUG -- BASEMESH VERSION: hm08
[2015-10-09 16:14:39,657] log.py->debug():94 -- DEBUG -- IS BUILT (FROZEN): No
[2015-10-09 16:14:39,657] log.py->debug():94 -- DEBUG -- IS RELEASE VERSION: No
[2015-10-09 16:14:39,657] log.py->debug():94 -- DEBUG -- WORKING DIRECTORY: D:\pythonprog\makehuman\main\makehuman
[2015-10-09 16:14:39,658] log.py->debug():94 -- DEBUG -- HOME LOCATION: C:\Users\kerol
[2015-10-09 16:14:39,658] log.py->debug():94 -- DEBUG -- PYTHON PATH: ./;./lib;./apps;./shared;./apps/gui;./core;D:\pythonprog\makehuman\main\makehuman;C:\Python27\python27.zip;C:\Python27\DLLs;C:\Python27\lib;C:\Python27\lib\plat-win;C:\Python27\lib\lib-tk;C:\Python27;C:\Python27\lib\site-packages
[2015-10-09 16:14:39,658] log.py->debug():94 -- DEBUG -- DLL PATH: C:\Python27\Lib\site-packages\PyQt4;C:\Program Files (x86)\Intel\iCLS Client\;C:\Program Files\Intel\iCLS Client\;C:\Windows\system32;C:\Windows;C:\Windows\System32\Wbem;C:\Windows\System32\WindowsPowerShell\v1.0\;C:\Program Files\Intel\Intel(R) Management Engine Components\DAL;C:\Program Files (x86)\Intel\Intel(R) Management Engine Components\DAL;C:\Program Files\Intel\Intel(R) Management Engine Components\IPT;C:\Program Files (x86)\Intel\Intel(R) Management Engine Components\IPT;C:\Program Files (x86)\NVIDIA Corporation\PhysX\Common;C:\Python27;C:\Python27\Lib\site-packages\;C:\Python27\Scripts\;C:\WINDOWS\system32;C:\WINDOWS;C:\WINDOWS\System32\Wbem;C:\WINDOWS\System32\WindowsPowerShell\v1.0\;C:\Program Files (x86)\Skype\Phone\
[2015-10-09 16:14:39,658] log.py->debug():94 -- DEBUG -- SYS.VERSION: 2.7.10 (default, May 23 2015, 09:40:32) [MSC v.1500 32 bit (Intel)]
[2015-10-09 16:14:39,658] log.py->debug():94 -- DEBUG -- SYS.PLATFORM: win32
[2015-10-09 16:14:39,658] log.py->debug():94 -- DEBUG -- SYS.EXECUTABLE: C:\Python27\python.exe
[2015-10-09 16:14:39,661] log.py->debug():94 -- DEBUG -- PLATFORM.MACHINE: AMD64
[2015-10-09 16:14:39,661] log.py->debug():94 -- DEBUG -- PLATFORM.PROCESSOR: Intel64 Family 6 Model 60 Stepping 3, GenuineIntel
[2015-10-09 16:14:39,661] log.py->debug():94 -- DEBUG -- PLATFORM.UNAME.RELEASE: 8
[2015-10-09 16:14:39,664] log.py->debug():94 -- DEBUG -- PLATFORM.WIN32_VER: 8 6.2.9200  Multiprocessor Free
[2015-10-09 16:14:39,667] log.py->error():108 -- ERROR -- Could not create debug dump
Traceback (most recent call last):
  File "makehuman.py", line 417, in debug_dump
    debugdump.dump.reset()
  File "./lib\debugdump.py", line 123, in reset
    import numpy
  File "C:\Python27\lib\site-packages\numpy\__init__.py", line 200, in <module>
    from . import add_newdocs
  File "C:\Python27\lib\site-packages\numpy\add_newdocs.py", line 13, in <module>
    from numpy.lib import add_newdoc
  File "C:\Python27\lib\site-packages\numpy\lib\__init__.py", line 8, in <module>
    from .type_check import *
  File "C:\Python27\lib\site-packages\numpy\lib\type_check.py", line 11, in <module>
    import numpy.core.numeric as _nx
  File "C:\Python27\lib\site-packages\numpy\core\__init__.py", line 14, in <module>
    from . import multiarray
ImportError: DLL load failed: %1 is not a valid Win32 application.
                                                                             


- makehuman-debug.txt
Code: Select all
VERSION: 1.1.0 (r? UNKNOWN) [none found]
HG REVISION: r? (UNKNOWN) [none found]
SHORT VERSION: v1.1.0
BASEMESH VERSION: hm08
IS BUILT (FROZEN): No
IS RELEASE VERSION: No
WORKING DIRECTORY: D:\pythonprog\makehuman\main\makehuman
HOME LOCATION: C:\Users\kerol
PYTHON PATH: ./;./lib;./apps;./shared;./apps/gui;./core;D:\pythonprog\makehuman\main\makehuman;C:\Python27\python27.zip;C:\Python27\DLLs;C:\Python27\lib;C:\Python27\lib\plat-win;C:\Python27\lib\lib-tk;C:\Python27;C:\Python27\lib\site-packages
DLL PATH: C:\Python27\Lib\site-packages\PyQt4;C:\Program Files (x86)\Intel\iCLS Client\;C:\Program Files\Intel\iCLS Client\;C:\Windows\system32;C:\Windows;C:\Windows\System32\Wbem;C:\Windows\System32\WindowsPowerShell\v1.0\;C:\Program Files\Intel\Intel(R) Management Engine Components\DAL;C:\Program Files (x86)\Intel\Intel(R) Management Engine Components\DAL;C:\Program Files\Intel\Intel(R) Management Engine Components\IPT;C:\Program Files (x86)\Intel\Intel(R) Management Engine Components\IPT;C:\Program Files (x86)\NVIDIA Corporation\PhysX\Common;C:\Python27;C:\Python27\Lib\site-packages\;C:\Python27\Scripts\;C:\WINDOWS\system32;C:\WINDOWS;C:\WINDOWS\System32\Wbem;C:\WINDOWS\System32\WindowsPowerShell\v1.0\;C:\Program Files (x86)\Skype\Phone\
SYS.VERSION: 2.7.10 (default, May 23 2015, 09:40:32) [MSC v.1500 32 bit (Intel)]
SYS.PLATFORM: win32
SYS.EXECUTABLE: C:\Python27\python.exe
PLATFORM.MACHINE: AMD64
PLATFORM.PROCESSOR: Intel64 Family 6 Model 60 Stepping 3, GenuineIntel
PLATFORM.UNAME.RELEASE: 8
PLATFORM.WIN32_VER: 8 6.2.9200  Multiprocessor Free

- python.err
Code: Select all
NO VERSION file detected, retrieving revision info from HG
NOTICE: Failed to get hg version number from command line: [Error 2] The system cannot find the file specified (This is just a head's up, not a critical error)
NOTICE: Failed to get hg version number using hglib: No module named hglib (This is just a head's up, not a critical error)
NOTICE: Failed to get hg parent version from dirstate file: [Errno 2] No such file or directory: 'D:\\pythonprog\\makehuman\\main\\.hg\\dirstate' (This is just a head's up, not a critical error)
NOTICE: Failed to get hg tip version from cache file: [Errno 2] No such file or directory: 'D:\\pythonprog\\makehuman\\main\\.hg\\cache\\tags' (This is just a head's up, not a critical error)
Detected HG revision: r? (UNKNOWN)
Initialized logging
VERSION: 1.1.0 (r? UNKNOWN) [none found]
HG REVISION: r? (UNKNOWN) [none found]
SHORT VERSION: v1.1.0
BASEMESH VERSION: hm08
IS BUILT (FROZEN): No
IS RELEASE VERSION: No
WORKING DIRECTORY: D:\pythonprog\makehuman\main\makehuman
HOME LOCATION: C:\Users\kerol
PYTHON PATH: ./;./lib;./apps;./shared;./apps/gui;./core;D:\pythonprog\makehuman\main\makehuman;C:\Python27\python27.zip;C:\Python27\DLLs;C:\Python27\lib;C:\Python27\lib\plat-win;C:\Python27\lib\lib-tk;C:\Python27;C:\Python27\lib\site-packages
DLL PATH: C:\Python27\Lib\site-packages\PyQt4;C:\Program Files (x86)\Intel\iCLS Client\;C:\Program Files\Intel\iCLS Client\;C:\Windows\system32;C:\Windows;C:\Windows\System32\Wbem;C:\Windows\System32\WindowsPowerShell\v1.0\;C:\Program Files\Intel\Intel(R) Management Engine Components\DAL;C:\Program Files (x86)\Intel\Intel(R) Management Engine Components\DAL;C:\Program Files\Intel\Intel(R) Management Engine Components\IPT;C:\Program Files (x86)\Intel\Intel(R) Management Engine Components\IPT;C:\Program Files (x86)\NVIDIA Corporation\PhysX\Common;C:\Python27;C:\Python27\Lib\site-packages\;C:\Python27\Scripts\;C:\WINDOWS\system32;C:\WINDOWS;C:\WINDOWS\System32\Wbem;C:\WINDOWS\System32\WindowsPowerShell\v1.0\;C:\Program Files (x86)\Skype\Phone\
SYS.VERSION: 2.7.10 (default, May 23 2015, 09:40:32) [MSC v.1500 32 bit (Intel)]
SYS.PLATFORM: win32
SYS.EXECUTABLE: C:\Python27\python.exe
PLATFORM.MACHINE: AMD64
PLATFORM.PROCESSOR: Intel64 Family 6 Model 60 Stepping 3, GenuineIntel
PLATFORM.UNAME.RELEASE: 8
PLATFORM.WIN32_VER: 8 6.2.9200  Multiprocessor Free
Could not create debug dump
Traceback (most recent call last):
  File "makehuman.py", line 417, in debug_dump
    debugdump.dump.reset()
  File "./lib\debugdump.py", line 123, in reset
    import numpy
  File "C:\Python27\lib\site-packages\numpy\__init__.py", line 200, in <module>
    from . import add_newdocs
  File "C:\Python27\lib\site-packages\numpy\add_newdocs.py", line 13, in <module>
    from numpy.lib import add_newdoc
  File "C:\Python27\lib\site-packages\numpy\lib\__init__.py", line 8, in <module>
    from .type_check import *
  File "C:\Python27\lib\site-packages\numpy\lib\type_check.py", line 11, in <module>
    import numpy.core.numeric as _nx
  File "C:\Python27\lib\site-packages\numpy\core\__init__.py", line 14, in <module>
    from . import multiarray
ImportError: DLL load failed: %1 is not a valid Win32 application.
Traceback (most recent call last):
  File "makehuman.py", line 846, in <module>
    main()
  File "makehuman.py", line 823, in main
    import numpy
  File "C:\Python27\lib\site-packages\numpy\__init__.py", line 200, in <module>
    from . import add_newdocs
  File "C:\Python27\lib\site-packages\numpy\add_newdocs.py", line 13, in <module>
    from numpy.lib import add_newdoc
  File "C:\Python27\lib\site-packages\numpy\lib\__init__.py", line 8, in <module>
    from .type_check import *
  File "C:\Python27\lib\site-packages\numpy\lib\type_check.py", line 11, in <module>
    import numpy.core.numeric as _nx
  File "C:\Python27\lib\site-packages\numpy\core\__init__.py", line 14, in <module>
    from . import multiarray
ImportError: DLL load failed: %1 is not a valid Win32 application.
                                                                                                                                                                                                                                                                                                                                                                                                                                                                                                                                                                                                                                                                                                                                                                                                                                                                                                                                                                                                                                                                                                                                                                                                                                                                                                                                                                                                                                                                                                                                                                                                                                                                                                                                                                                                                                                                                                                                                                                                                                                                                                                                                                                                                                                                                                                                                                                                                                                                                                                                                                                                                                                                                                                                                                                                                                                                                                                                                                                                                                                                                                                                                                                                                                                                                                                                                                                                                                                                                                                                                                                                                                                                                                                                                                                                                                                                                                                                                                                                                                                                                                                                                                                                                                                                                                                                                                                                                                                                                                           


and the file pyhton_out.txt turned to be empty
krollquink
 
Posts: 12
Joined: Mon Jun 08, 2015 3:02 am
Location: Japan

Re: Makehuman script help

Postby joepal » Sat Oct 10, 2015 8:45 am

Looks as if you have a problem with 64-bit dlls installed in a 32-bit python. Given where the crash happens, my spontaneous guess is that you've accidentally installed a 64-bit numpy.

Since it'd be very tricky to debug this, my suggestion is to wipe/uninstall the current python installation and then re-download all dependencies and make really sure you only download 32-bit versions of everything.

Or, if you can find such, download 64-bit python and 64-bit versions of all dependencies. As long as you don't mix them.

(The reason for the 32-bit recommendation was that when we wrote it, some dependencies were yet not available as 64 bit)
Joel Palmius (LinkedIn)
MakeHuman Infrastructure Manager
http://www.palmius.com/joel
joepal
 
Posts: 3453
Joined: Wed Jun 04, 2008 11:20 am

Re: Makehuman script help

Postby duststorm » Sat Oct 10, 2015 11:16 am

The problem is with numpy:
Code: Select all
  File "./lib\debugdump.py", line 123, in reset
    import numpy
...
ImportError: DLL load failed: %1 is not a valid Win32 application.


It cannot find the correct numpy DLLs.
Make sure you have installed python 2.7 32bit for windows.
Make sure you have installed numpy for python 2.7 32bit
Make sure you have installed pyOpenGL for python 2.7 32bit
Make sure you have installed riverbank pyQt for python 2.7 32bit

If these are correct, then MakeHuman should run.

If you fear that alternative versions of these libraries installed on your system could be interfering, then you could try uninstalling them.


If you try combining 32 and 64bit DLLs you will get a crash, so make sure they are all 32bit. We at MakeHuman only recommend the official distributions of those libraries (for numpy, that is the downloads from numpy.org), use something else and you're on your own.
The official numpy distribution for windows is only available in 32bit version, simply because there are no free 64bit fortran compilers available for windows. That's why you will have to match everything else to this 32bit requirement.
If you want 64bit, you'll have to use Mac OSX or linux, or use windows libraries that we do not officially support.

In any case, you will not see any benefits of using 64bit whatsoever. MakeHuman uses 32bit data structures internally and does not need to address that much memory that 64bit would become advantageous. Contrary to what some people want to make you believe, 64bit is not faster than 32bit. If anything, it's slower (granted that libraries like numpy, whether they are 32 or 64bit are always compiled to use the most of your CPU features).
MakeHuman™ developer
User avatar
duststorm
 
Posts: 2563
Joined: Fri Jan 27, 2012 11:57 am
Location: Belgium

Re: Makehuman script help

Postby krollquink » Wed Oct 14, 2015 12:53 am

i tried to installl all in win32 but makehuman still doesnt appear
this is the result that i get.
the type of error is different after i changed all to win32
maybe pyhton_err show some error
seems like same dll error


-makehuman.log
Code: Select all
[2015-10-14 09:46:05,313] log.py->message():115 -- MESSAGE -- Initialized logging
[2015-10-14 09:46:05,316] log.py->debug():94 -- DEBUG -- VERSION: 1.1.0 (r? UNKNOWN) [none found]
[2015-10-14 09:46:05,316] log.py->debug():94 -- DEBUG -- HG REVISION: r? (UNKNOWN) [none found]
[2015-10-14 09:46:05,318] log.py->debug():94 -- DEBUG -- SHORT VERSION: v1.1.0
[2015-10-14 09:46:05,318] log.py->debug():94 -- DEBUG -- BASEMESH VERSION: hm08
[2015-10-14 09:46:05,318] log.py->debug():94 -- DEBUG -- IS BUILT (FROZEN): No
[2015-10-14 09:46:05,318] log.py->debug():94 -- DEBUG -- IS RELEASE VERSION: No
[2015-10-14 09:46:05,318] log.py->debug():94 -- DEBUG -- WORKING DIRECTORY: D:\pythonprog\makehuman\main\makehuman
[2015-10-14 09:46:05,318] log.py->debug():94 -- DEBUG -- HOME LOCATION: C:\Users\kerol
[2015-10-14 09:46:05,318] log.py->debug():94 -- DEBUG -- PYTHON PATH: ./;./lib;./apps;./shared;./apps/gui;./core;D:\pythonprog\makehuman\main\makehuman;C:\WINDOWS\SYSTEM32\python27.zip;C:\Python27\DLLs;C:\Python27\lib;C:\Python27\lib\plat-win;C:\Python27\lib\lib-tk;C:\Python27;C:\Python27\lib\site-packages
[2015-10-14 09:46:05,318] log.py->debug():94 -- DEBUG -- DLL PATH: C:\Python27\Lib\site-packages\PyQt4;C:\Program Files (x86)\Intel\iCLS Client\;C:\Program Files\Intel\iCLS Client\;C:\Windows\system32;C:\Windows;C:\Windows\System32\Wbem;C:\Windows\System32\WindowsPowerShell\v1.0\;C:\Program Files\Intel\Intel(R) Management Engine Components\DAL;C:\Program Files (x86)\Intel\Intel(R) Management Engine Components\DAL;C:\Program Files\Intel\Intel(R) Management Engine Components\IPT;C:\Program Files (x86)\Intel\Intel(R) Management Engine Components\IPT;C:\Program Files (x86)\NVIDIA Corporation\PhysX\Common;C:\Python27;C:\Python27\Lib\site-packages\;C:\Python27\Scripts\;C:\WINDOWS\system32;C:\WINDOWS;C:\WINDOWS\System32\Wbem;C:\WINDOWS\System32\WindowsPowerShell\v1.0\;C:\Program Files (x86)\Skype\Phone\
[2015-10-14 09:46:05,318] log.py->debug():94 -- DEBUG -- SYS.VERSION: 2.7 (r27:82525, Jul  4 2010, 09:01:59) [MSC v.1500 32 bit (Intel)]
[2015-10-14 09:46:05,318] log.py->debug():94 -- DEBUG -- SYS.PLATFORM: win32
[2015-10-14 09:46:05,318] log.py->debug():94 -- DEBUG -- SYS.EXECUTABLE: C:\Python27\python.exe
[2015-10-14 09:46:05,321] log.py->debug():94 -- DEBUG -- PLATFORM.MACHINE: AMD64
[2015-10-14 09:46:05,322] log.py->debug():94 -- DEBUG -- PLATFORM.PROCESSOR: Intel64 Family 6 Model 60 Stepping 3, GenuineIntel
[2015-10-14 09:46:05,322] log.py->debug():94 -- DEBUG -- PLATFORM.UNAME.RELEASE: post2008Server
[2015-10-14 09:46:05,322] log.py->debug():94 -- DEBUG -- PLATFORM.WIN32_VER: post2008Server 6.2.9200  Multiprocessor Free
[2015-10-14 09:46:05,375] log.py->debug():94 -- DEBUG -- NUMPY.VERSION: 1.6.0
[2015-10-14 09:46:05,388] acceleratesupport.py-><module>():17 -- MESSAGE -- No OpenGL_accelerate module loaded: No module named OpenGL_accelerate


-makehuman-debug
Code: Select all
VERSION: 1.1.0 (r? UNKNOWN) [none found]
HG REVISION: r? (UNKNOWN) [none found]
SHORT VERSION: v1.1.0
BASEMESH VERSION: hm08
IS BUILT (FROZEN): No
IS RELEASE VERSION: No
WORKING DIRECTORY: D:\pythonprog\makehuman\main\makehuman
HOME LOCATION: C:\Users\kerol
PYTHON PATH: ./;./lib;./apps;./shared;./apps/gui;./core;D:\pythonprog\makehuman\main\makehuman;C:\WINDOWS\SYSTEM32\python27.zip;C:\Python27\DLLs;C:\Python27\lib;C:\Python27\lib\plat-win;C:\Python27\lib\lib-tk;C:\Python27;C:\Python27\lib\site-packages
DLL PATH: C:\Python27\Lib\site-packages\PyQt4;C:\Program Files (x86)\Intel\iCLS Client\;C:\Program Files\Intel\iCLS Client\;C:\Windows\system32;C:\Windows;C:\Windows\System32\Wbem;C:\Windows\System32\WindowsPowerShell\v1.0\;C:\Program Files\Intel\Intel(R) Management Engine Components\DAL;C:\Program Files (x86)\Intel\Intel(R) Management Engine Components\DAL;C:\Program Files\Intel\Intel(R) Management Engine Components\IPT;C:\Program Files (x86)\Intel\Intel(R) Management Engine Components\IPT;C:\Program Files (x86)\NVIDIA Corporation\PhysX\Common;C:\Python27;C:\Python27\Lib\site-packages\;C:\Python27\Scripts\;C:\WINDOWS\system32;C:\WINDOWS;C:\WINDOWS\System32\Wbem;C:\WINDOWS\System32\WindowsPowerShell\v1.0\;C:\Program Files (x86)\Skype\Phone\
SYS.VERSION: 2.7 (r27:82525, Jul  4 2010, 09:01:59) [MSC v.1500 32 bit (Intel)]
SYS.PLATFORM: win32
SYS.EXECUTABLE: C:\Python27\python.exe
PLATFORM.MACHINE: AMD64
PLATFORM.PROCESSOR: Intel64 Family 6 Model 60 Stepping 3, GenuineIntel
PLATFORM.UNAME.RELEASE: post2008Server
PLATFORM.WIN32_VER: post2008Server 6.2.9200  Multiprocessor Free
NUMPY.VERSION: 1.6.0



pyhton_err
Code: Select all
NO VERSION file detected, retrieving revision info from HG
NOTICE: Failed to get hg version number from command line: [Error 2] The system cannot find the file specified (This is just a head's up, not a critical error)
NOTICE: Failed to get hg version number using hglib: No module named hglib (This is just a head's up, not a critical error)
NOTICE: Failed to get hg parent version from dirstate file: [Errno 2] No such file or directory: 'D:\\pythonprog\\123\\123\\.hg\\dirstate' (This is just a head's up, not a critical error)
NOTICE: Failed to get hg tip version from cache file: [Errno 2] No such file or directory: 'D:\\pythonprog\\123\\123\\.hg\\cache\\tags' (This is just a head's up, not a critical error)
Detected HG revision: r? (UNKNOWN)
Initialized logging
VERSION: 1.1.0 (r? UNKNOWN) [none found]
HG REVISION: r? (UNKNOWN) [none found]
SHORT VERSION: v1.1.0
BASEMESH VERSION: hm08
IS BUILT (FROZEN): No
IS RELEASE VERSION: No
WORKING DIRECTORY: D:\pythonprog\123\123\makehuman
HOME LOCATION: C:\Users\kerol
PYTHON PATH: ./;./lib;./apps;./shared;./apps/gui;./core;D:\pythonprog\123\123\makehuman;C:\WINDOWS\SYSTEM32\python27.zip;C:\Python27\DLLs;C:\Python27\lib;C:\Python27\lib\plat-win;C:\Python27\lib\lib-tk;C:\Python27;C:\Python27\lib\site-packages
DLL PATH: C:\Python27\Lib\site-packages\PyQt4;C:\Program Files (x86)\Intel\iCLS Client\;C:\Program Files\Intel\iCLS Client\;C:\Windows\system32;C:\Windows;C:\Windows\System32\Wbem;C:\Windows\System32\WindowsPowerShell\v1.0\;C:\Program Files\Intel\Intel(R) Management Engine Components\DAL;C:\Program Files (x86)\Intel\Intel(R) Management Engine Components\DAL;C:\Program Files\Intel\Intel(R) Management Engine Components\IPT;C:\Program Files (x86)\Intel\Intel(R) Management Engine Components\IPT;C:\Program Files (x86)\NVIDIA Corporation\PhysX\Common;C:\Python27;C:\Python27\Lib\site-packages\;C:\Python27\Scripts\;C:\WINDOWS\system32;C:\WINDOWS;C:\WINDOWS\System32\Wbem;C:\WINDOWS\System32\WindowsPowerShell\v1.0\;C:\Program Files (x86)\Skype\Phone\
SYS.VERSION: 2.7 (r27:82525, Jul  4 2010, 09:01:59) [MSC v.1500 32 bit (Intel)]
SYS.PLATFORM: win32
SYS.EXECUTABLE: C:\Python27\python.exe
PLATFORM.MACHINE: AMD64
PLATFORM.PROCESSOR: Intel64 Family 6 Model 60 Stepping 3, GenuineIntel
PLATFORM.UNAME.RELEASE: post2008Server
PLATFORM.WIN32_VER: post2008Server 6.2.9200  Multiprocessor Free
NUMPY.VERSION: 1.6.0
No OpenGL_accelerate module loaded: No module named OpenGL_accelerate
Traceback (most recent call last):
  File "makehuman.py", line 846, in <module>
    main()
  File "makehuman.py", line 835, in main
    from mhmain import MHApplication
  File "./core\mhmain.py", line 46, in <module>
    import mh
  File "./lib\mh.py", line 51, in <module>
    from qtui import Keys, Buttons, Modifiers, Application
  File "./lib\qtui.py", line 44, in <module>
    from PyQt4 import QtCore, QtGui, QtOpenGL
ImportError: DLL load failed: The specified module could not be found.
krollquink
 
Posts: 12
Joined: Mon Jun 08, 2015 3:02 am
Location: Japan

Next

Return to Python scripts

Who is online

Users browsing this forum: Google [Bot] and 1 guest